{"text_format":"1","workbook":"xlsx","n_sheets":11,"sheets":["startup","defaults","forage_cost","birth_wean","wean_conception","conception_calving","summary","blank","form_data","lookup_tables","Input sheet"],"not_rendered":{"charts":0,"images":7,"macros":1,"external_links":0,"defined_names":2,"comments":4,"pivot_tables":0},"unopened":[],"bounds":{"document_bytes":16777216,"sheet_cells":100000,"rows_first":2000,"rows_last":500,"rows_between":2000,"halvings":0,"cell_chars":16384,"cell_head_chars":4096},"cells_cut":0,"cells_raw":0,"read":"whole","date_system":"1900"}

{"sheet":"startup","index":0,"n_rows":36,"n_cols":24,"rows_kept":36,"cut":false,"hidden":false,"merged":[[13,1,13,8],[14,1,14,8],[15,1,15,8]]}
["Heifer Rearing Cost Calculator "]
["Version 26.08, 15.10"]
[null,"This calculator enables you to calculate the cost of rearing heifers through to the point of calving.  You will be "]
[null,"provided with a summary of the cash cost of rearing heifers on your system, and the full economic cost.  "]
[]
[null,"The calculator is loaded with default values for you, but we suggest you use the actual values for your farm if "]
[null,"they are available.  "]
[]
[null,"It is very important that you read the supporting guidance material for this tool before use.  "]
[]
[]
[null,null,null,null,null,null,null,null,null,null,null,"            Jun",30,31,31,30,31,30,31,31,28,31,30,31]
[null,null,null,null,null,null,null,null,null,null,null,"            Jul",31,31,30,31,30,31,31,28,31,30,31,30]
[null,"AHDB Dairy is a division of the Agricultural and Horticultural Development Board.",null,null,null,null,null,null,null,null,null,"            Aug "]
[null,"While the Agriculture and Horticulture Development Board seeks to ensure that the information contained within this document is accurate at the time of printing, no warranty is given in respect thereof and, to the maximum extent permitted by law, the Agriculture and Horticulture Development Board accepts no liability for loss, damage or injury howsoever caused (including that caused by negligence) or suffered directly or indirectly in relation to information and opinions contained in or omitted from this document. ",null,null,null,null,null,null,null,null,null,"            Sep",31,30,31,30,31,31,28,31,30,31,30,31]
[null,"© Agriculture and Horticulture Development Board 2015. All rights reserved. ",null,null,null,null,null,null,null,null,null,"            Oct",30,31,30,31,31,28,31,30,31,30,31,31]
[null,null,null,null,null,null,null,null,null,null,null,"            Nov",31,30,31,31,28,31,30,31,30,31,31,30]
[null,null,null,null,null,null,null,null,null,null,null,"            Dec",30,31,31,28,31,30,31,30,31,31,30,31]
[null,null,null,null,null,null,null,null,null,null,null,"            Jan",31,31,28,31,30,31,30,31,31,30,31,30]
[null,null,null,null,null,null,null,null,null,null,null,"            Feb",31,28,31,30,31,30,31,31,30,31,30,31]
[null,null,null,null,null,null,null,null,null,null,null,"            Mar",28,31,30,31,30,31,31,30,31,30,31,31]
[null,null,null,null,null,null,null,null,null,null,null,null,31,30,31,30,31,31,30,31,30,31,31,28]
[]
[]
[]
[]
[]
[]
[]
[]
[]
[]
[]
[]
[]
[null,null,null,12]

{"sheet":"defaults","index":1,"n_rows":42,"n_cols":11,"rows_kept":42,"cut":false,"hidden":false,"merged":[]}
[]
[]
[]
[]
[]
[]
[]
[]
[]
[]
[null,null,null,null,null,"Heifer Rearing Cost Calculator "]
[]
[null,null,null,null,null,"Below are the default values which will be used in these calculations.  If you have your own, more accurate figures, "]
[null,null,null,null,null,"you can use them here instead."]
[]
[null,null,null,null,null,"To recall a default value, click the        next to the item heading              indicates the default value is in use"]
[]
[]
[null,null,null,null,null,"Replacement heifer calf value (£/hd)",200,null,null,"Water (£/hd)",29]
[]
[null,null,null,null,null,"Beef calf value (£/hd)",150,null,null,"Electricity (£/hd)",22]
[]
[null,null,null,null,null,"Milk powder (£/T)",1500,null,null,"Consumables (£/hd)",16.5]
[]
[null,null,null,null,null,"Calf starter mix (£/T)",230,null,null,"Interest rate (%)",4]
[]
[null,null,null,null,null,"Rearing concentrate (£/T)",210,null,null,"Land opportunity cost (£/ha)",265]
[]
[null,null,null,null,null,"Feeding straw (£/T)",41,null,null,"AI price (£/service)",50]
[]
[null,null,null,null,null,"Feeding hay (£/T)",50,null,null,"Conception rate to AI (%)",40]
[]
[null,null,null,null,null,"Bedding material (£/T)",36,null,null,"Pregnancy Testing (£/hd)",10]
[]
[null,null,null,null,null,"Disposal cost (£/carcase)",30,null,null,"Milk price (ppl)",21]
[]
[null,null,null,null,null,"Labour cost (£/hr)",10,null,null,"Margin over Puchased Feed (ppl)",15]
[]
[]
[null,null,null,null,null,"Age at first calving (months)",24,null,null,"Mature cow weight (kg)",650]
{"$rows_left_out":3}
{"sheet":"forage_cost","index":2,"n_rows":69,"n_cols":16,"rows_kept":69,"cut":false,"hidden":false,"merged":[]}
[]
[]
[]
[]
[]
[]
[]
[]
[]
[null,null,null,null,null,"Heifer Rearing Cost Calculator "]
[]
[]
[]
[null,null,null,null,null,"Forage Cost Calculator"]
[]
[null,null,null,null,null,"Crop Type",null,"Grazing",null,"Grass Silage (3 cuts)",null,"Maize",null,"Wholecrop",null,"Green forage catch crops"]
[null,null,null,null,null,"Crop Life (years)",null,8,null,5,null,1,null,1,null,1]
[]
[]
[null,null,null,null,null,"Establishment Costs",null,"£ / Ha.",null,"£ / Ha.",null,"£ / Ha.",null,"£ / Ha.",null,"£ / Ha."]
[null,null,null,null,null,"Seed",null,150,null,150,null,150,null,59,null,14]
[null,null,null,null,null,"Fertilisers",null,75,null,75,null,190,null,276,null,150]
[null,null,null,null,null,"Sprays& slug pellets",null,30,null,30,null,53,null,186,null,15]
[null,null,null,null,null,"Labour & Machinery:"]
[null,null,null,null,null,"Cultivations (plough, p. harrow, roll)",null,150,null,150,null,150,null,130,null,45]
[null,null,null,null,null,"Sowing",null,30,null,30,null,44,null,46,null,25]
[null,null,null,null,null,"Fertilising",null,14,null,14,null,14,null,28,null,14]
[null,null,null,null,null,"Spraying & slug pelleting",null,13,null,13,null,26,null,50,null,11]
[]
[null,null,null,null,null,"Total Establishment Cost",null,{"$f":"SUM(H21:H28)","v":462},null,{"$f":"SUM(J21:J28)","v":462},null,{"$f":"SUM(L21:L28)","v":627},null,{"$f":"SUM(N21:N28)","v":775},null,{"$f":"SUM(P21:P28)","v":274}]
[null,null,null,null,null,"Establishment cost per year",null,{"$f":"H30/H17","v":57.75},null,{"$f":"J30/J17","v":92.4},null,{"$f":"L30/L17","v":627},null,{"$f":"N30/N17","v":775},null,{"$f":"P30/P17","v":274}]
[]
[]
[null,null,null,null,null,"Production Costs"]
[null,null,null,null,null,"Fertilisers",null,200,null,250,null,0,null,0,null,0]
[null,null,null,null,null,"Sprays",null,0,null,0,null,0,null,0,null,0]
[null,null,null,null,null,"Additive",null,0,null,0,null,0,null,0,null,0]
[null,null,null,null,null,"Sundries",null,0,null,20,null,20,null,20,null,0]
[null,null,null,null,null,"Labour & Machinery:"]
[null,null,null,null,null,"Fertilising",null,42,null,56,null,0,null,0,null,0]
{"$rows_left_out":30}
{"sheet":"birth_wean","index":3,"n_rows":141,"n_cols":15,"rows_kept":141,"cut":false,"hidden":false,"merged":[]}
[]
[]
[]
[]
[]
[]
[]
[]
[]
[]
[null,null,null,null,null,"Heifer Rearing Cost Calculator "]
[]
[]
[]
[null,null,null,null,null,{"$f":"\" Birth to Weaning  (\"& INT(G82) &\" kg at weaning)\"","v":" Birth to Weaning  (81 kg at weaning)"}]
[]
[null,null,null,null,null,"Based on the information you have entered, we have calculated your birth to weaning period costs as follows: "]
[null,null,null,null,null,null,null,null,null,null,null,"Costs"]
[]
[]
[]
[]
[]
[]
[]
[]
[]
[]
[null,null,null,null,null,null,null,null,null,null,null,null,null,"Source "]
[]
[null,null,null,null,null,null,null,null,null,"Quantity",null,"£"]
[null,null,null,null,null,null,"Calf value ",null,null,null,null,{"$f":"defaults!G19","v":200}]
[]
[null,null,null,null,null,null,"Milk Powder",null,null,{"$f":"LEFT(K42,3) & \" kg\"","v":"0 kg"},null,{"$f":"IF(form_data!E16=\"\",birth_wean!L42,(form_data!E16/1000)*defaults!G23)","v":0}]
[null,null,null,null,null,null,null,"Age","powder/day (g)","days ","powder (kg)","Total £"]
[null,null,null,null,null,null,null,{"$f":"form_data!$C$21","v":"1-9 days"},{"$f":"IF(form_data!F21=\"\",0,form_data!F21*form_data!G21)","v":0},{"$f":"form_data!$C$9","v":9.3333333333333339},{"$f":"I36*J36/1000","v":0}]
[null,null,null,null,null,null,null,{"$f":"form_data!$C$22","v":"10-18 days"},{"$f":"IF(form_data!F22=\"\",0,form_data!F22*form_data!G22)","v":0},{"$f":"form_data!$C$9","v":9.3333333333333339},{"$f":"I37*J37/1000","v":0}]
[null,null,null,null,null,null,null,{"$f":"form_data!$C$23","v":"19-27 days"},{"$f":"IF(form_data!F23=\"\",0,form_data!F23*form_data!G23)","v":0},{"$f":"form_data!$C$9","v":9.3333333333333339},0]
[null,null,null,null,null,null,null,{"$f":"form_data!$C$24","v":"28-36 days"},{"$f":"IF(form_data!F24=\"\",0,form_data!F24*form_data!G24)","v":0},{"$f":"form_data!$C$9","v":9.3333333333333339},0]
[null,null,null,null,null,null,null,{"$f":"form_data!$C$25","v":"37-45 days"},{"$f":"IF(form_data!F25=\"\",0,form_data!F25*form_data!G25)","v":0},{"$f":"form_data!$C$9","v":9.3333333333333339},0]
{"$rows_left_out":102}
{"sheet":"wean_conception","index":4,"n_rows":160,"n_cols":36,"rows_kept":160,"cut":false,"hidden":false,"merged":[[48,20,48,23],[48,24,48,27],[48,28,48,31],[48,32,48,33],[48,34,48,35]]}
[]
[]
[]
[]
[]
[]
[]
[]
[]
[]
[null,null,null,null,null,"Heifer Rearing Cost Calculator "]
[]
[]
[]
[null,null,null,null,null,{"$f":" \"Weaning to Conception  (\" & INT(N23) & \"kg to \" & INT(N24) & \" kg)\"","v":"Weaning to Conception  (81kg to 380 kg)"}]
[]
[null,null,null,null,null,"Based on the information you have entered, we have calculated your weaning to conception period costs as follows: "]
[null,null,null,null,null,null,null,null,null,null,null,"costs"]
[]
[]
[null,null,null,null,null,null,"Age at Conception",null,null,null,null,null,null,{"$f":"(defaults!G40*4.33)-(274/7)","v":64.777142857142849},"wks"]
[null,null,null,null,null,null,"Number of weeks in Weaning to Conception Group",null,null,null,null,null,null,{"$f":"N21-defaults!G42","v":56.777142857142849},"wks"]
[null,null,null,null,null,null,"weight at weaning",null,null,null,null,null,null,{"$f":"(VLOOKUP(defaults!G42,lookup_tables!$A$12:$C$116,3,TRUE))","v":81.25},"kg"]
[null,null,null,null,null,null,{"$f":" \"weight at   \" & INT(N21+0.5)  & \"  weeks\"","v":"weight at   65  weeks"},null,null,null,null,null,null,{"$f":"(VLOOKUP(N21,lookup_tables!A14:C118,3,TRUE))","v":380.41249999999997},"kg"]
[null,null,null,null,null,null,"average daily weight gain required",null,null,null,null,null,null,{"$f":"(N24-N23)/N22/7","v":0.75272368156199676},"kg/d"]
[]
[]
[]
[]
[]
[]
[null,null,null,null,null,null,"Forage cost","T Fresh","T DM",null,null,"£"]
[null,null,null,null,null,null,"Grass Silage",{"$f":"IF(I33=\"\",0,I33/forage_cost!J60*100)","v":0.73889565707094784},{"$f":"IF(form_data!E116>0,form_data!E116,X57*1.15)","v":0.22166869712128434},null,null,{"$f":"IF(I33=\"\",0,I33*forage_cost!J54)","v":21.127042005632227}]
[null,null,null,null,null,null,"Maize Silage",{"$f":"IF(I34=\"\",0,I34/forage_cost!J61*100)","v":0},{"$f":"IF(form_data!F116>0,form_data!F116,AB57*1.15)","v":0},null,null,{"$f":"IF(I34=\"\",0,I34*forage_cost!J55)","v":0}]
[null,null,null,null,null,null,"Wholecrop",{"$f":"IF(I35=\"\",0,I35/forage_cost!J62*100)","v":0},{"$f":"IF(form_data!G116>0,form_data!G116,AF57*1.15)","v":0},null,null,{"$f":"IF(I35=\"\",0,I35*forage_cost!J56)","v":0}]
[null,null,null,null,null,null,"Grazing",null,{"$f":"IF(form_data!I116>0,form_data!I116,AH57*1.15)","v":0},null,null,{"$f":"I36*forage_cost!H54","v":0}]
[null,null,null,null,null,null,"Green crop",null,{"$f":"IF(form_data!J116>0,form_data!J116,AJ57*1.15)","v":0},null,null,{"$f":"I37*forage_cost!P54","v":0}]
[null,null,null,null,null,null,"Total forage costs",null,null,null,null,{"$f":"SUM(L33:L37)","v":21.127042005632227}]
[]
[]
{"$rows_left_out":121}
{"sheet":"conception_calving","index":5,"n_rows":126,"n_cols":38,"rows_kept":126,"cut":false,"hidden":false,"merged":[[39,22,39,25],[39,26,39,29],[39,30,39,33],[39,34,39,35],[39,36,39,37]]}
[]
[]
[]
[]
[]
[]
[]
[]
[]
[]
[null,null,null,null,null,"Heifer Rearing Cost Calculator "]
[]
[]
[]
[null,null,null,null,null,{"$f":"\"Conception to Calving (\" & INT(M19) & \"kg to \" & INT(M20) & \"kg)\"","v":"Conception to Calving (380kg to 586kg)"}]
[]
[null,null,null,null,null,"Based on the information you have entered, we have calculated your conception to calving period costs as follows: "]
[]
[null,null,null,null,null,null,null,null,null,null,"Wt entering this group",null,{"$f":"wean_conception!N24","v":380.41249999999997},"kg"]
[null,null,null,null,null,null,"Age at Calving",null,{"$f":"defaults!G40*4.33","v":103.92},"weeks","Wt at calving",null,{"$f":"(VLOOKUP(I20,lookup_tables!A12:C116,3,TRUE))","v":586.1171875},"kg","DLW in this group",null,{"$f":"(M20-M19)/(I21*7)","v":0.75074703467153292}]
[null,null,null,null,null,null,"Weeks in group",null,{"$f":"274/7","v":39.142857142857146}]
[null,null,null,null,null,null,"Weeks in late preg",null,{"$f":"I21/3","v":13.047619047619049},{"$f":"I20-I22","v":90.872380952380951},"weeks to",{"$f":"I20","v":103.92},"weeks = ",{"$f":"AVERAGE(L22,J22)","v":97.396190476190469},"Avg Age Late Preg"]
[null,null,null,null,null,null,"Weeks in mid preg",null,{"$f":"I21/3","v":13.047619047619049},{"$f":"L23-I23","v":77.8247619047619},"weeks to",{"$f":"J22","v":90.872380952380951},"weeks = ",{"$f":"AVERAGE(L23,J23)","v":84.348571428571432},"Avg Age Mid Preg"]
[null,null,null,null,null,null,"Weeks in early preg",null,{"$f":"I21/3","v":13.047619047619049},{"$f":"L24-I24","v":64.777142857142849},"weeks to",{"$f":"J23","v":77.8247619047619},"weeks = ",{"$f":"AVERAGE(L24,J24)","v":71.300952380952367},"Avg Age Early Preg"]
[]
[]
[]
[]
[]
[]
[]
[null,null,null,null,null,null,null,null,null,null,null,"costs"]
[null,null,null,null,null,null,"Forage cost",null,"T Fresh","T DM",null,"£"]
[null,null,null,null,null,null,"Grass Silage",null,{"$f":"J34/forage_cost!J60*100","v":9.99780521349855},{"$f":"IF(form_data!E216>0,form_data!E216*forage_cost!J60/100,Z45*1.15)","v":2.9993415640495646},null,{"$f":"J34*forage_cost!J54","v":285.86451779541488}]
[null,null,null,null,null,null,"Maize Silage",null,{"$f":"J35/forage_cost!L60*100","v":0},{"$f":"IF(form_data!F216>0,form_data!F216*forage_cost!L60/100,AD45*1.15)","v":0},null,{"$f":"J35*forage_cost!L54","v":0}]
[null,null,null,null,null,null,"Wholecrop",null,{"$f":"J36/forage_cost!N60*100","v":0},{"$f":"IF(form_data!G216>0,form_data!G216*forage_cost!N60/100,AH45*1.15)","v":0},null,{"$f":"J36*forage_cost!N54","v":0}]
[null,null,null,null,null,null,"Grazing",null,null,{"$f":"IF(form_data!I216>0,form_data!I216,AJ45*1.15)","v":0.68341093502579475},null,{"$f":"J37*forage_cost!H54","v":36.429599564291671}]
[null,null,null,null,null,null,"Green crop",null,null,{"$f":"IF(form_data!J216>0,form_data!J216/100,AL45*1.15)","v":0},null,{"$f":"J38*forage_cost!P54","v":0}]
[null,null,null,null,null,null,"Total forage costs",null,null,null,null,{"$f":"SUM(L34:L38)","v":322.29411735970655},null,null,null,null,null,null,null,null,null,null,null,null,null,null,null,null,null,null,null,null,null,null,"if both green crop and grazing assume 50% of each"]
[null,null,null,null,null,null,null,"Avg Age","Bodyweight","DMI ","DMI from ","WT gain","MEm Req","MEg","Total ME","ME from conc","Me Req from forage","combined Forage ME",null,"Forage DMI","Weighted DM","Total Forage ","Grass Silage",null,null,null,"Maize",null,null,null,"Wholecrop ",null,null,null,"Grazing",null,"Green Crop"]
{"$rows_left_out":87}
{"sheet":"summary","index":6,"n_rows":80,"n_cols":9,"rows_kept":80,"cut":false,"hidden":false,"merged":[[77,5,77,10],[78,5,78,10],[79,5,79,10],[61,5,61,10]]}
[]
[]
[]
[]
[]
[]
[]
[]
[]
[]
[null,null,null,null,null,"Heifer Rearing Cost Calculator "]
[]
[]
[]
[]
[]
[]
[]
[]
[]
[]
[]
[]
[]
[]
[]
[]
[]
[]
[]
[null,null,null,null,null,"Summary of Costs"]
[]
[]
[null,null,null,null,null,null,"Standard ",null,"Your Farm "]
[null,null,null,null,null,null,"Calving at 24 Months ",null,"£"]
[null,null,null,null,null,"Cash Cost "]
[]
[null,null,null,null,null,"Birth to Weaning ( incl. calf value)",288.95999999999998,null,{"$f":"birth_wean!L141","v":288.95773020467055}]
[]
[null,null,null,null,null,"Weaning to Conception ",274.63,null,{"$f":"wean_conception!L157","v":336.47675298927419}]
{"$rows_left_out":41}
{"sheet":"blank","index":7,"n_rows":116,"n_cols":10,"rows_kept":116,"cut":false,"hidden":false,"merged":[]}
["birth_wean"]
[]
[]
[]
[]
[]
[]
[]
[]
[]
[]
[]
[]
[]
[]
[]
[]
[]
[]
[]
[]
[]
[]
[]
[]
[]
[]
[]
[]
[]
[]
[]
[]
[]
[]
[]
[]
[]
[]
[]
{"$rows_left_out":77}
{"sheet":"form_data","index":8,"n_rows":223,"n_cols":17,"rows_kept":223,"cut":false,"hidden":false,"merged":[]}
[]
[]
[]
[]
[]
[]
[null,"Age Bracket Calculation "]
[null,"Age at weaning ",{"$f":"defaults!G42*7","v":56},"days"]
[null,"=",{"$f":"C8/6","v":9.3333333333333339},"days per period in b>w period"]
[null,"=",{"$f":"ROUND(C9,0)","v":9},"days per period in b>w period rounded"]
[]
[]
[null,null,"Data populated from birth to weaning form "]
[]
[null,null,null,"Bedding (kg)","Milk Replacer (kg)","Whole Milk (L)","Conc (kg)","Feed Straw (kg)","Feed Hay (kg)"]
[null,null,"Total","","","","","",""]
[]
[]
[]
[null,null,"Age","Bedding Yes","Bedding No ","Milk Replacer L","Mixing Rate (g/l)","Whole Milk (L)","Conc (kg)","Straw Yes","Straw No","Hay Yes","Hay No"]
[null,null,{"$f":"\"1-\" & C10 & \" days\"","v":"1-9 days"},true,false,"","0","","",true,false,false,true]
[null,null,{"$f":"C10+1&\"-\"&C10*2&\" days\"","v":"10-18 days"},true,false,"","0","","",true,false,false,true]
[null,null,{"$f":"C10*2+1&\"-\"&C10*3&\" days\"","v":"19-27 days"},true,false,"","0","","",true,false,false,true]
[null,null,{"$f":"C10*3+1&\"-\"&C10*4&\" days\"","v":"28-36 days"},true,false,"","0","","",true,false,false,true]
[null,null,{"$f":"C10*4+1&\"-\"&C10*5&\" days\"","v":"37-45 days"},true,false,"","0","","",true,false,false,true]
[null,null,{"$f":"C10*5+1&\"-\"&C10*6&\" days\"","v":"46-54 days"},true,false,"","0","","",true,false,false,true]
[]
[]
[]
[]
[]
[]
[]
[]
[]
[]
[]
[]
[]
[]
{"$rows_left_out":184}
{"sheet":"lookup_tables","index":9,"n_rows":116,"n_cols":3,"rows_kept":116,"cut":false,"hidden":false,"merged":[]}
["Lookup Tables"]
[]
[]
[]
[]
[]
[]
[]
["1:  % of mature weight with age"]
[]
["age (wks)","%","weight kg"]
[0,6.2,{"$f":"defaults!$K$40*(lookup_tables!B12/100)","v":40.299999999999997}]
[1,7.1,{"$f":"defaults!$K$40*(lookup_tables!B13/100)","v":46.15}]
[2,8,{"$f":"defaults!$K$40*(lookup_tables!B14/100)","v":52}]
[3,8.9,{"$f":"defaults!$K$40*(lookup_tables!B15/100)","v":57.850000000000009}]
[4,9.8000000000000007,{"$f":"defaults!$K$40*(lookup_tables!B16/100)","v":63.7}]
[5,10.475,{"$f":"defaults!$K$40*(lookup_tables!B17/100)","v":68.087499999999991}]
[6,11.15,{"$f":"defaults!$K$40*(lookup_tables!B18/100)","v":72.474999999999994}]
[7,{"$f":"AVERAGE(B18,B20)","v":11.824999999999999},{"$f":"defaults!$K$40*(lookup_tables!B19/100)","v":76.862499999999997}]
[8,12.5,{"$f":"defaults!$K$40*(lookup_tables!B20/100)","v":81.25}]
[9,{"$f":"AVERAGE(B20,B22)","v":13.45},{"$f":"defaults!$K$40*(lookup_tables!B21/100)","v":87.424999999999983}]
[10,14.4,{"$f":"defaults!$K$40*(lookup_tables!B22/100)","v":93.600000000000009}]
[11,15.35,{"$f":"defaults!$K$40*(lookup_tables!B23/100)","v":99.774999999999991}]
[12,16.3,{"$f":"defaults!$K$40*(lookup_tables!B24/100)","v":105.95}]
[13,17.149999999999999,{"$f":"defaults!$K$40*(lookup_tables!B25/100)","v":111.47499999999999}]
[14,18,{"$f":"defaults!$K$40*(lookup_tables!B26/100)","v":117}]
[15,{"$f":"AVERAGE(B28,B26)","v":18.850000000000001},{"$f":"defaults!$K$40*(lookup_tables!B27/100)","v":122.52500000000001}]
[16,19.7,{"$f":"defaults!$K$40*(lookup_tables!B28/100)","v":128.04999999999998}]
[17,{"$f":"AVERAGE(B30,B28)","v":20.7},{"$f":"defaults!$K$40*(lookup_tables!B29/100)","v":134.54999999999998}]
[18,21.7,{"$f":"defaults!$K$40*(lookup_tables!B30/100)","v":141.05000000000001}]
[19,21.7,{"$f":"defaults!$K$40*(lookup_tables!B31/100)","v":141.05000000000001}]
[20,{"$f":"AVERAGE(B33,B31)","v":22.7},{"$f":"defaults!$K$40*(lookup_tables!B32/100)","v":147.54999999999998}]
[21,23.7,{"$f":"defaults!$K$40*(lookup_tables!B33/100)","v":154.04999999999998}]
[22,{"$f":"AVERAGE(B35,B33)","v":24.7},{"$f":"defaults!$K$40*(lookup_tables!B34/100)","v":160.55000000000001}]
[23,25.7,{"$f":"defaults!$K$40*(lookup_tables!B35/100)","v":167.05}]
[24,25.7,{"$f":"defaults!$K$40*(lookup_tables!B36/100)","v":167.05}]
[25,{"$f":"AVERAGE(B38,B36)","v":26.7},{"$f":"defaults!$K$40*(lookup_tables!B37/100)","v":173.55}]
[26,27.7,{"$f":"defaults!$K$40*(lookup_tables!B38/100)","v":180.04999999999998}]
[27,28.875,{"$f":"defaults!$K$40*(lookup_tables!B39/100)","v":187.6875}]
[28,28.875,{"$f":"defaults!$K$40*(lookup_tables!B40/100)","v":187.6875}]
{"$rows_left_out":77}
{"sheet":"Input sheet","index":10,"n_rows":57,"n_cols":13,"rows_kept":57,"cut":false,"hidden":false,"merged":[]}
[]
[]
[]
[]
[]
[]
[null,null,null,null,null,null,null,"Heifer Rearing Cost Calculator "]
[]
[null,null,null,null,null,null,null,"Input Sheet "]
[]
[null,null,null,null,null,null,null,"Default values are loaded here but we suggest you use your own values if you have them."]
[]
[null,null,null,null,null,null,null,"Replacement heifer calf value (£/hd)",200,null,null,"Water (£/hd)",29]
[]
[null,null,null,null,null,null,null,"Beef calf value (£/hd)",150,null,null,"Electricity (£/hd)",22]
[]
[null,null,null,null,null,null,null,"Milk powder (£/T)",1500,null,null,"Consumables (£/hd)",16.5]
[]
[null,null,null,null,null,null,null,"Calf starter mix (£/T)",230,null,null,"Interest rate (%)",4]
[]
[null,null,null,null,null,null,null,"Rearing concentrate (£/T)",210,null,null,"Land opportunity cost (£/ha)",265]
[]
[null,null,null,null,null,null,null,"Feeding straw (£/T)",41,null,null,"AI price (£/service)",50]
[]
[null,null,null,null,null,null,null,"Feeding hay (£/T)",50,null,null,"Conception rate to AI (%)",40]
[]
[null,null,null,null,null,null,null,"Bedding material (£/T)",36,null,null,"Pregnancy Testing (£/hd)",10]
[]
[null,null,null,null,null,null,null,"Disposal cost (£/carcase)",30,null,null,"Milk price (ppl)",21]
[]
[null,null,null,null,null,null,null,"Labour cost (£/hr)",10,null,null,"Margin over Puchased Feed (ppl)",15]
[]
[]
[null,null,null,null,null,null,null,"Age at first calving (months)",24,null,null,"Mature cow weight (kg)",650]
[]
[null,null,null,null,null,null,null,"Age at weaning (weeks)",8,null,null,"Heifer lactation yield (l)",8000]
[]
[]
[null,null,null,null,null,null,null,"Birth to Weaning "]
[]
{"$rows_left_out":17}